مكنز اليونسكو
type: ConceptScheme
preferred label: Тезаурус ЮНЕСКО @ru
preferred label: Thésaurus de l'UNESCO @fr
preferred label: Tesauro de la UNESCO @es
preferred label: UNESCO Thesaurus @en

الجبل الأسود
type: Concept
created: 2006-08-09T00:00:00
modified: 2019-12-15T14:36:47+00:00
alternative label: مونتينيغرو
alternative label: مونتينيجرو
broader: بلدان البحر الابيض المتوسط
broader: وسط وشرق اوروبا
hidden label: الجبل الاسود
hidden label: Montenegro @fr
in scheme: مكنز اليونسكو
preferred label: Montenegro @en
preferred label: Monténégro @fr
preferred label: Черногория @ru
related: صربيا والجبل الاسود
scope note: استخدم للأحداث التي وقعت بعد ٣ يونيو ٢٠٠٦. للأحداث التي وقعت بين ٤ فبراير ٢٠٠٣ و٣ يونيو ٢٠٠٦، استخدم صربيا وجبل أسود. للأحداث السابقة لهذه التواريخ، استخدم يوغوسلافيا.
scope note: Se aplica a los eventos posteriores al 3 de junio del 2006. Para eventos acaecidos entre el 4 de febrero del 2003 y el 3 de junio del 2006 emplear Serbia y Montenegro. Para eventos anteriores, utilizar Yugoslavia. @es
scope note: S'applique aux événements survenus après le 3 juin 2006. Pour les événements survenus entre le 4 février 2003 et le 3 juin 2006 utiliser Serbie et Monténégro. Pour les événements antérieurs, utiliser Yougoslavie. @fr
scope note: Используется по отношению к событиям, происходившим после 3 июня 2006 г. Для событий, происходивших в период с 4 февраля 2003 г. по 3 июня 2006 г., используйте термин «Сербия и Черногория». Для событий, происходивших ранее, используйте термин «Югославия». @ru
scope note: Use for events after 3 June 2006. For events between 4 February 2003 and 3 June 2006 use Serbia and Montenegro. For earlier events use Yugoslavia. @en

وسط وشرق اوروبا
type: Concept
narrower: الجبل الأسود
preferred label: Центральная и Восточная Европа @ru
preferred label: Europe centrale et orientale @fr
preferred label: Europa Central y Oriental @es
preferred label: Central and Eastern Europe @en

صربيا والجبل الاسود
type: Concept
preferred label: Сербия и Черногория @ru
preferred label: Serbie-Monténégro @fr
preferred label: Serbia y Montenegro @es
preferred label: Serbia and Montenegro @en
related: الجبل الأسود

بلدان البحر الابيض المتوسط
type: Concept
narrower: الجبل الأسود
preferred label: Страны Средиземноморья @ru
preferred label: Pays méditerranéen @fr
preferred label: País mediterráneo @es
preferred label: Mediterranean countries @en

بلدان ومجموعات بلدان
type: Domain
type: Collection
type: ConceptGroup
member: أوروبا
preferred label: Страны и группы стран @ru
preferred label: Pays et ensembles de pays @fr
preferred label: Países y agrupaciones de países @es
preferred label: Countries and country groupings @en

أوروبا
type: Collection
type: MicroThesaurus
type: ConceptGroup
member: الجبل الأسود
preferred label: Европа @ru
preferred label: Europe @fr
preferred label: Europa @es